{"text_format":"1","workbook":"xlsx","n_sheets":3,"sheets":["定年延長及び暫定再任用希望調書","記入例","学校一覧"],"not_rendered":{"charts":0,"images":0,"macros":0,"external_links":0,"defined_names":2,"comments":2,"pivot_tables":0},"unopened":[],"bounds":{"document_bytes":16777216,"sheet_cells":100000,"rows_first":2000,"rows_last":500,"rows_between":2000,"halvings":0,"cell_chars":16384,"cell_head_chars":4096},"cells_cut":0,"cells_raw":0,"read":"whole","date_system":"1900"}

{"sheet":"定年延長及び暫定再任用希望調書","index":0,"n_rows":40,"n_cols":30,"rows_kept":40,"cut":false,"hidden":false,"merged":[[0,2,0,27],[1,0,1,2],[1,3,1,6],[1,7,1,8],[1,9,1,13],[1,21,1,22],[1,23,1,25],[6,25,6,27],[25,18,25,29],[2,23,3,29],[3,1,4,9],[3,11,3,19],[4,15,4,19],[4,20,4,22],[4,23,4,29],[2,0,4,0],[2,1,2,2],[2,3,2,9],[2,10,4,10],[2,12,2,19],[2,20,3,22],[5,20,5,22],[6,20,7,22],[6,28,6,29],[7,23,7,29],[8,0,13,2],[8,15,10,29],[9,4,9,14],[11,3,11,29],[12,4,12,28],[13,3,13,29],[5,0,7,0],[5,1,7,9],[5,10,7,10],[5,11,7,14],[5,15,7,15],[5,16,7,19],[14,23,15,29],[15,0,15,2],[15,3,15,5],[15,6,15,8],[16,0,18,2],[16,3,17,5],[16,6,16,10],[16,11,18,15],[16,16,18,29],[17,6,17,10],[14,0,14,2],[14,3,14,5],[14,6,14,8],[14,9,15,12],[14,13,15,18],[14,19,15,22],[18,3,18,5],[18,6,18,10],[26,3,26,4],[26,5,26,9],[26,10,26,17],[26,18,28,29],[27,3,27,4],[29,18,29,20],[29,21,29,23],[29,24,29,27],[19,0,21,2],[19,3,21,29],[22,0,24,2],[22,3,24,29],[27,5,27,9],[27,10,27,17],[28,3,28,4],[28,5,28,9],[28,10,28,17],[25,0,28,2],[25,3,25,4],[25,5,25,9],[25,10,25,17],[31,24,31,25],[32,0,33,2],[32,3,32,29],[33,13,33,18],[34,0,36,2],[35,5,35,6],[35,7,35,9],[35,10,35,11],[35,12,35,14],[29,0,31,2],[29,3,30,5],[30,6,30,7],[30,9,30,10],[30,12,30,13],[30,15,30,16],[30,18,30,19],[30,21,30,22],[30,24,30,26],[29,6,29,8],[29,9,29,11],[29,12,29,14],[29,15,29,17],[38,0,39,14],[38,15,38,20],[38,21,38,22],[38,26,38,27],[39,15,39,18],[39,20,39,28],[35,15,35,16],[35,17,35,19],[35,20,35,21],[35,22,35,24],[37,0,37,14],[37,16,37,29]]}
["（様式１）",null,"定年延長及び暫定再任用希望調書"]
["学校番号(4桁)",null,null,null,null,null,null,null,null,null,null,null,null,null,null,null,null,null,null,null,null,"記入日：",null,"令和７年",null,null,null,"月",null,"日"]
["氏名","フリガナ",null,null,null,null,null,null,null,null,"住所","〒",null,null,null,null,null,null,null,null,"職員コード"]
[]
[null,null,null,null,null,null,null,null,null,null,null,null,null,null,"℡",null,null,null,null,null,"性　別"]
["学校名",{"$f":"IFERROR(VLOOKUP(D2,学校一覧!A:B,2,FALSE),\"\")","v":""},null,null,null,null,null,null,null,null,"補職名",null,null,null,null,"教科",null,null,null,null,"生年月日",null,null,"昭和",null,"年",null,"月",null,"日"]
[null,null,null,null,null,null,null,null,null,null,null,null,null,null,null,null,null,null,null,null,"年　齢",null,null,null,null,null,null,null,"歳"]
[null,null,null,null,null,null,null,null,null,null,null,null,null,null,null,null,null,null,null,null,null,null,null,"（令和７年度末現在）"]
["任用希望\n確認欄",null,null,null,null,null,null,null,null,null,null,null,null,null,null,"※暫定再任用の勤務形態は、フルタイムを原則とします。短時間勤務を希望した場合であっても、人事配置の都合上、フルタイム勤務として選考結果を提示する場合があります。\n※「任用を希望しない」を選択された場合でも、本市の講師任用状況等により、確認のご連絡をさせていただくことがあります。"]
[]
[]
[null,null,null,"【短時間勤務を希望する理由　　※短時間勤務を希望する場合は必ず記入すること】"]
[]
[null,null,null,"※ 任用を希望しない場合は、以下の入力は不要です。"]
["居住校区",null,null,"小学校区：",null,null,null,null,null,"使用可能な\n通勤手段",null,null,null,null,null,null,null,null,null,"所有している\n免許状等"]
["（市内居住者のみ）",null,null,"中学校区："]
[" 令和７年度の\n 担任･担当教科等",null,null,null,null,null,"（担任をしている場合）",null,null,null,null,"特技又は教科等\n以外で指導できること"]
[]
[null,null,null,"担当教科："]
[" 学校職員として\n 特に尽力したこと"]
[]
[]
[" 貢献できること"]
[]
[]
[" 福岡市立学校または市教育委員会に勤務または通学する親族等\n（婚姻予定を含む）",null,null,"続　柄",null,"氏　名",null,null,null,null,"学校名等",null,null,null,null,null,null,null,"健康状態 （既往歴も含めて記入のこと）"]
[]
[]
[]
[" 略歴\n （講師歴は不要）",null,null,"現所属",null,null,"（前所属）",null,null,"（前々所属）"]
[null,null,null,null,null,null,null,null,"学校",null,null,"学校",null,null,"学校",null,null,"学校",null,null,"学校",null,null,"学校",null,null,null,"学校"]
[null,null,null,"在課",null,"年","在課",null,"年","在課",null,"年","在課",null,"年","在課",null,"年","在課",null,"年","在課",null,"年","在課",null,null,"年"]
[" 配置先希望",null,null," ※ 下記の（１）と（２）のどちらも記入してください。"]
[null,null,null,"（１） 現所属校での配置を希望しますか。"]
[" ※ 希望どおりと\n 　　ならない場合も\n　　 あります。",null,null,"（２） 現所属校以外に配置される場合に希望する区を、第１～４希望まで必ず全て記入してください。"]
[null,null,null,null,null,"第１希望",null,null,null,null,"第２希望",null,null,null,null,"第３希望",null,null,null,null,"第４希望"]
[]
["任用にあたって特に配慮が必要なこと",null,null,null,null,null,null,null,null,null,null,null,null,null,null,null,"障害者雇用促進法に基づく障がい者雇用状況の報告に使用するため、障がい者手帳を所有の場合は、記入をお願いします。（任意）"]
[null,null,null,null,null,null,null,null,null,null,null,null,null,null,null," （１）障がい手帳の等級",null,null,null,null,null,null,null,null,"級"]
[null,null,null,null,null,null,null,null,null,null,null,null,null,null,null," （２）障がいの内容",null,null,null,"（",null,null,null,null,null,null,null,null,null,"）"]

{"sheet":"記入例","index":1,"n_rows":40,"n_cols":30,"rows_kept":40,"cut":false,"hidden":false,"merged":[[39,20,39,28],[35,17,35,19],[35,20,35,21],[35,22,35,24],[37,0,37,14],[37,16,37,29],[38,0,39,14],[38,15,38,20],[38,21,38,22],[38,26,38,27],[39,15,39,18],[31,24,31,25],[32,0,33,2],[32,3,32,29],[33,13,33,18],[34,0,36,2],[35,5,35,6],[35,7,35,9],[35,10,35,11],[35,12,35,14],[35,15,35,16],[29,0,31,2],[29,3,30,5],[29,18,29,20],[29,21,29,23],[29,24,29,27],[30,6,30,7],[30,9,30,10],[30,12,30,13],[30,15,30,16],[30,18,30,19],[30,21,30,22],[30,24,30,26],[29,6,29,8],[29,9,29,11],[29,12,29,14],[29,15,29,17],[22,0,24,2],[22,3,24,29],[25,0,28,2],[25,3,25,4],[25,5,25,9],[25,10,25,17],[25,18,25,29],[26,3,26,4],[26,5,26,9],[26,10,26,17],[26,18,28,29],[27,3,27,4],[27,5,27,9],[27,10,27,17],[28,3,28,4],[28,5,28,9],[28,10,28,17],[16,0,18,2],[16,3,17,5],[16,6,16,10],[16,11,18,15],[16,16,18,29],[17,6,17,10],[18,3,18,5],[18,6,18,10],[19,0,21,2],[19,3,21,29],[14,0,14,2],[14,3,14,5],[14,6,14,8],[14,9,15,12],[14,13,15,18],[14,19,15,22],[14,23,15,29],[15,0,15,2],[15,3,15,5],[15,6,15,8],[5,20,5,22],[6,20,7,22],[6,25,6,27],[6,28,6,29],[7,23,7,29],[8,0,13,2],[8,15,10,29],[9,4,9,14],[11,3,11,29],[12,4,12,28],[5,0,7,0],[5,1,7,9],[5,10,7,10],[5,11,7,14],[5,15,7,15],[5,16,7,19],[13,3,13,29],[0,2,0,27],[1,0,1,2],[1,3,1,6],[1,7,1,8],[1,9,1,13],[1,21,1,22],[1,23,1,25],[2,23,3,29],[3,1,4,9],[3,11,3,19],[4,15,4,19],[4,20,4,22],[4,23,4,29],[2,0,4,0],[2,1,2,2],[2,3,2,9],[2,10,4,10],[2,12,2,19],[2,20,3,22]]}
["（様式１）",null,"定年延長及び暫定再任用希望調書"]
["学校番号(4桁)",null,null,"1001",null,null,null,null,null,null,null,null,null,null,null,null,null,null,null,null,null,"記入日：",null,{"$f":"定年延長及び暫定再任用希望調書!X2","v":"令和７年"},null,null,10,"月",18,"日"]
["氏名","フリガナ",null,"キョウイク　イチロウ",null,null,null,null,null,null,"住所","〒","810-8621",null,null,null,null,null,null,null,"職員コード",null,null,"1234567"]
[null,"教育　一郎",null,null,null,null,null,null,null,null,null,"福岡市中央区天神１丁目８番１号"]
[null,null,null,null,null,null,null,null,null,null,null,null,null,null,"℡","090-1234-5678",null,null,null,null,"性　別",null,null,"男"]
["学校名",{"$f":"IFERROR(VLOOKUP(D2,学校一覧!A:B,2,FALSE),\"\")","v":"舞鶴小学校"},null,null,null,null,null,null,null,null,"補職名","教諭",null,null,null,"教科",null,null,null,null,"生年月日",null,null,"昭和",39,"年",12,"月",24,"日"]
[null,null,null,null,null,null,null,null,null,null,null,null,null,null,null,null,null,null,null,null,"年　齢",null,null,null,null,61,null,null,"歳"]
[null,null,null,null,null,null,null,null,null,null,null,null,null,null,null,null,null,null,null,null,null,null,null,{"$f":"定年延長及び暫定再任用希望調書!X8","v":"（令和７年度末現在）"}]
["任用希望\n確認欄",null,null,null,null,null,null,null,null,null,null,null,null,null,null,"※暫定再任用の勤務形態は、フルタイムを原則とします。短時間勤務を希望した場合であっても、人事配置の都合上、フルタイム勤務として選考結果を提示する場合があります。\n※「任用を希望しない」を選択された場合でも、本市の講師任用状況等により、確認のご連絡をさせていただくことがあります。"]
[null,null,null,null,"フルタイム勤務を希望する"]
[]
[null,null,null,"【短時間勤務を希望する理由　　※短時間勤務を希望する場合は必ず記入すること】"]
[]
[null,null,null,"※ 任用を希望しない場合は、以下の入力は不要です。"]
["居住校区",null,null,"小学校区：",null,null,"天神北小",null,null,"使用可能な\n通勤手段",null,null,null,"自家用車、バス、地下鉄",null,null,null,null,null,"所有している\n免許状等",null,null,null,"小一種、中一種（国語）\n司書教諭"]
["（市内居住者のみ）",null,null,"中学校区：",null,null,"天神北中"]
[{"$f":"定年延長及び暫定再任用希望調書!A17","v":" 令和７年度の\n 担任･担当教科等"},null,null,"担任をしている",null,null,"（担任をしている場合）",null,null,null,null,"特技又は教科等\n以外で指導できること",null,null,null,null,"ダンス、書道"]
[null,null,null,null,null,null,"4年生"]
[null,null,null,"担当教科："]
[" 学校職員として\n 特に尽力したこと",null,null,"これまでに学年主任を３校で計６回務め、校務等が円滑に行えるよう責任を持って取り組んだ。\n今年度は、４年生担任として、児童がお互いを認め合うことのできる学級作りを心がけてきた。"]
[]
[]
[" 貢献できること",null,null,"積み重ねた知識や経験を経験を生かして学級経営に取り組みたい。\nまた、若手教員の育成に積極的に関わり、これまでの経験で培ったものを伝えていきたい。"]
[]
[]
[" 福岡市立学校または市教育委員会に勤務または通学する親族等\n（婚姻予定を含む）",null,null,"続　柄",null,"氏　名",null,null,null,null,"学校名等",null,null,null,null,null,null,null,"健康状態 （既往歴も含めて記入のこと）"]
[null,null,null,"弟",null,"教育　次郎",null,null,null,null,"中洲中学校",null,null,null,null,null,null,null,"　・令和元年度に、心臓疾患のため入院。\n　　現在も月に１回通院している。\n　・高血圧症のため、月に２回通院している\n　　（常備薬あり）。"]
[null,null,null,"義妹",null,"博多　花子",null,null,null,null,"教育委員会教職員第２課"]
[]
[" 略歴\n （講師歴は不要）",null,null,"現所属",null,null,"（前所属）",null,null,"（前々所属）"]
[null,null,null,null,null,null,"那の津小",null,"学校","南箱崎",null,"学校","川端小",null,"学校","東福岡小",null,"学校","福岡北小",null,"学校",null,null,"学校",null,null,null,"学校"]
[null,null,null,"在課",4,"年","在課",6,"年","在課",6,"年","在課",6,"年","在課",6,"年","在課",4,"年","在課",null,"年","在課",null,null,"年"]
[" 配置先希望",null,null," ※ 下記の（１）と（２）のどちらも記入してください。"]
[null,null,null,"（１） 現所属校での配置を希望しますか。",null,null,null,null,null,null,null,null,null,"希望する"]
[" ※ 希望どおりと\n 　　ならない場合も\n　　 あります。",null,null,"（２） 現所属校以外に配置される場合に希望する区を、第１～４希望まで必ず全て記入してください。"]
[null,null,null,null,null,"第１希望",null,"東区",null,null,"第２希望",null,"博多区",null,null,"第３希望",null,"早良区",null,null,"第４希望",null,"城南区"]
[]
["任用にあたって特に配慮が必要なこと",null,null,null,null,null,null,null,null,null,null,null,null,null,null,null,"障害者雇用促進法に基づく障がい者雇用状況の報告に使用するため、障がい者手帳を所有の場合は、記入をお願いします。（任意）"]
["上記に記載のとおり、心臓疾患で通院をしているが、病院が\nやや遠方であるため、月に一度は有給休暇を取得する必要が\nあります。",null,null,null,null,null,null,null,null,null,null,null,null,null,null," （１）障がい手帳の等級",null,null,null,null,null,"身体",null,1,"級"]
[null,null,null,null,null,null,null,null,null,null,null,null,null,null,null," （２）障がいの内容",null,null,null,"（","心臓機能障害",null,null,null,null,null,null,null,null,"）"]

{"sheet":"学校一覧","index":2,"n_rows":463,"n_cols":2,"rows_kept":463,"cut":false,"hidden":true,"merged":[]}
["学校番号","学校名"]
["1001","舞鶴小学校"]
["1002","当仁小学校"]
["1003","博多小学校"]
["1008","警固小学校"]
["1009","西新小学校"]
["1010","春吉小学校"]
["1011","住吉小学校"]
["1012","草ケ江小学校"]
["1013","堅粕小学校"]
["1014","馬出小学校"]
["1015","千代小学校"]
["1016","原小学校"]
["1017","長尾小学校"]
["1018","吉塚小学校"]
["1019","東住吉小学校"]
["1020","筥松小学校"]
["1021","平尾小学校"]
["1022","高宮小学校"]
["1023","姪浜小学校"]
["1024","席田小学校"]
["1025","三宅小学校"]
["1026","花畑小学校"]
["1027","月隈小学校"]
["1028","箱崎小学校"]
["1029","壱岐小学校"]
["1030","能古小学校"]
["1031","今宿小学校"]
["1032","今津小学校"]
["1033","玉川小学校"]
["1034","高取小学校"]
["1035","鳥飼小学校"]
["1036","西高宮小学校"]
["1037","赤坂小学校"]
["1038","百道小学校"]
["1039","曰佐小学校"]
["1040","宮竹小学校"]
["1041","田隈小学校"]
["1042","香椎小学校"]
["1043","多々良小学校"]
["1044","名島小学校"]
["1045","大楠小学校"]
["1046","春住小学校"]
["1047","板付小学校"]
["1048","那珂小学校"]
["1049","那珂南小学校"]
["1050","香住丘小学校"]
["1051","東光小学校"]
["1052","南当仁小学校"]
["1053","東吉塚小学校"]
["1055","若久小学校"]
["1056","笹丘小学校"]
["1057","内浜小学校"]
["1058","室見小学校"]
["1059","別府小学校"]
["1060","和白小学校"]
["1061","金武小学校"]
["1063","周船寺小学校"]
["1064","元岡小学校"]
["1065","北崎小学校"]
["1066","玄界小学校"]
["1067","小呂小学校"]
["1068","千早小学校"]
["1069","小笹小学校"]
["1070","七隈小学校"]
["1071","老司小学校"]
["1072","原西小学校"]
["1073","長住小学校"]
["1074","原北小学校"]
["1075","筑紫丘小学校"]
["1076","西花畑小学校"]
["1077","弥永小学校"]
["1078","堤小学校"]
["1079","飯倉小学校"]
["1080","城浜小学校"]
["1081","若宮小学校"]
["1082","城南小学校"]
["1083","勝馬小学校"]
["1084","志賀島小学校"]
["1085","西戸崎小学校"]
["1086","東花畑小学校"]
["1087","金山小学校"]
["1088","下山門小学校"]
["1089","長丘小学校"]
["1090","美和台小学校"]
["1091","八田小学校"]
["1092","板付北小学校"]
["1093","西長住小学校"]
["1094","賀茂小学校"]
["1095","脇山小学校"]
["1096","内野小学校"]
["1098","入部小学校"]
["1099","東月隈小学校"]
["1100","有田小学校"]
["1101","壱岐南小学校"]
["1102","和白東小学校"]
["1103","片江小学校"]
["1104","野芥小学校"]
["1105","西陵小学校"]
["1106","舞松原小学校"]
["1107","福浜小学校"]
["1108","南片江小学校"]
["1109","大原小学校"]
["1110","香椎東小学校"]
["1111","弥永西小学校"]
["1112","東若久小学校"]
["1113","四箇田小学校"]
["1114","壱岐東小学校"]
["1115","石丸小学校"]
["1116","鶴田小学校"]
["1117","田島小学校"]
["1118","愛宕小学校"]
["1119","福重小学校"]
["1120","三筑小学校"]
["1121","飯原小学校"]
["1122","青葉小学校"]
["1123","奈多小学校"]
["1124","野多目小学校"]
["1125","高木小学校"]
["1126","堤丘小学校"]
["1127","有住小学校"]
["1128","城原小学校"]
["1129","香椎浜小学校"]
["1130","大池小学校"]
["1131","早良小学校"]
["1132","香椎下原小学校"]
["1133","弥生小学校"]
["1134","塩原小学校"]
["1135","田村小学校"]
["1136","千早西小学校"]
["1137","東箱崎小学校"]
["1138","柏原小学校"]
["1139","飯倉中央小学校"]
["1140","玄洋小学校"]
["1141","小田部小学校"]
["1142","香陵小学校"]
["1143","百道浜小学校"]
["1144","松島小学校"]
["1145","横手小学校"]
["1146","三苫小学校"]
["1147","愛宕浜小学校"]
["1148","姪北小学校"]
["1149","照葉小学校"]
["1150","西都小学校"]
["1151","照葉北小学校"]
["1152","西都北小学校"]
["1153","照葉はばたき小学校"]
["2001","箱崎中学校"]
["2002","福岡中学校"]
["2003","千代中学校"]
["2004","東光中学校"]
["2005","博多中学校"]
["2007","東住吉中学校"]
["2008","春吉中学校"]
["2009","舞鶴中学校"]
["2010","高宮中学校"]
["2011","三宅中学校"]
["2012","警固中学校"]
["2013","当仁中学校"]
["2014","城西中学校"]
["2015","百道中学校"]
["2016","西福岡中学校"]
["2017","姪浜中学校"]
["2018","玄洋中学校"]
["2019","能古中学校"]
["2020","香椎第１中学校"]
["2021","多々良中学校"]
["2022","住吉中学校"]
["2023","花畑中学校"]
["2024","高取中学校"]
["2025","友泉中学校"]
["2026","筑紫丘中学校"]
["2027","三筑中学校"]
["2028","那珂中学校"]
["2029","和白中学校"]
["2030","金武中学校"]
["2031","吉塚中学校"]
["2032","城南中学校"]
["2033","元岡中学校"]
["2034","北崎中学校"]
["2035","平尾中学校"]
["2036","玄界中学校"]
["2037","梅林中学校"]
["2038","長尾中学校"]
["2039","小呂中学校"]
["2040","志賀中学校"]
["2041","香椎第２中学校"]
["2042","曰佐中学校"]
["2043","原中学校"]
["2044","席田中学校"]
["2045","壱岐中学校"]
["2046","早良中学校"]
["2047","多々良中央中学校"]
["2048","原北中学校"]
["2049","長丘中学校"]
["2050","西陵中学校"]
["2051","田隈中学校"]
["2052","和白丘中学校"]
["2053","内浜中学校"]
["2054","老司中学校"]
["2055","次郎丸中学校"]
["2056","香椎第３中学校"]
["2057","柏原中学校"]
["2058","城香中学校"]
["2059","片江中学校"]
["2060","壱岐丘中学校"]
["2061","板付中学校"]
["2062","下山門中学校"]
["2063","宮竹中学校"]
["2064","横手中学校"]
["2065","原中央中学校"]
["2066","青葉中学校"]
["2067","野間中学校"]
["2068","松崎中学校"]
["2069","箱崎清松中学校"]
["2070","照葉中学校"]
["2090","福岡きぼう中学校"]
[2080,"百道松原中学校"]
["3001","福岡中央特別支援学校"]
["3002","若久特別支援学校"]
["3003","屋形原特別支援学校"]
["3004","南福岡特別支援学校"]
["3005","東福岡特別支援学校"]
["3006","生の松原特別支援学校"]
["3007","今津特別支援学校"]
["3008","特別支援学校「博多高等学園」"]
["3009","特別支援学校「清水高等学園」"]
[3010,"特別支援学校「城浜高等学園」"]
["5001","福翔高等学校"]
["5002","博多工業高等学校"]
["5003","福岡女子高等学校"]
["5004","福岡西陵高等学校"]
["１００１","舞鶴小学校"]
["１００２","当仁小学校"]
["１００３","博多小学校"]
["１００８","警固小学校"]
["１００９","西新小学校"]
["１０１０","春吉小学校"]
["１０１１","住吉小学校"]
["１０１２","草ケ江小学校"]
["１０１３","堅粕小学校"]
["１０１４","馬出小学校"]
["１０１５","千代小学校"]
["１０１６","原小学校"]
["１０１７","長尾小学校"]
["１０１８","吉塚小学校"]
["１０１９","東住吉小学校"]
["１０２０","筥松小学校"]
["１０２１","平尾小学校"]
["１０２２","高宮小学校"]
["１０２３","姪浜小学校"]
["１０２４","席田小学校"]
["１０２５","三宅小学校"]
["１０２６","花畑小学校"]
["１０２７","月隈小学校"]
["１０２８","箱崎小学校"]
["１０２９","壱岐小学校"]
["１０３０","能古小学校"]
["１０３１","今宿小学校"]
["１０３２","今津小学校"]
["１０３３","玉川小学校"]
["１０３４","高取小学校"]
["１０３５","鳥飼小学校"]
["１０３６","西高宮小学校"]
["１０３７","赤坂小学校"]
["１０３８","百道小学校"]
["１０３９","曰佐小学校"]
["１０４０","宮竹小学校"]
["１０４１","田隈小学校"]
["１０４２","香椎小学校"]
["１０４３","多々良小学校"]
["１０４４","名島小学校"]
["１０４５","大楠小学校"]
["１０４６","春住小学校"]
["１０４７","板付小学校"]
["１０４８","那珂小学校"]
["１０４９","那珂南小学校"]
["１０５０","香住丘小学校"]
["１０５１","東光小学校"]
["１０５２","南当仁小学校"]
["１０５３","東吉塚小学校"]
["１０５５","若久小学校"]
["１０５６","笹丘小学校"]
["１０５７","内浜小学校"]
["１０５８","室見小学校"]
["１０５９","別府小学校"]
["１０６０","和白小学校"]
["１０６１","金武小学校"]
["１０６３","周船寺小学校"]
["１０６４","元岡小学校"]
["１０６５","北崎小学校"]
["１０６６","玄界小学校"]
["１０６７","小呂小学校"]
["１０６８","千早小学校"]
["１０６９","小笹小学校"]
["１０７０","七隈小学校"]
["１０７１","老司小学校"]
["１０７２","原西小学校"]
["１０７３","長住小学校"]
["１０７４","原北小学校"]
["１０７５","筑紫丘小学校"]
["１０７６","西花畑小学校"]
["１０７７","弥永小学校"]
["１０７８","堤小学校"]
["１０７９","飯倉小学校"]
["１０８０","城浜小学校"]
["１０８１","若宮小学校"]
["１０８２","城南小学校"]
["１０８３","勝馬小学校"]
["１０８４","志賀島小学校"]
["１０８５","西戸崎小学校"]
["１０８６","東花畑小学校"]
["１０８７","金山小学校"]
["１０８８","下山門小学校"]
["１０８９","長丘小学校"]
["１０９０","美和台小学校"]
["１０９１","八田小学校"]
["１０９２","板付北小学校"]
["１０９３","西長住小学校"]
["１０９４","賀茂小学校"]
["１０９５","脇山小学校"]
["１０９６","内野小学校"]
["１０９８","入部小学校"]
["１０９９","東月隈小学校"]
["１１００","有田小学校"]
["１１０１","壱岐南小学校"]
["１１０２","和白東小学校"]
["１１０３","片江小学校"]
["１１０４","野芥小学校"]
["１１０５","西陵小学校"]
["１１０６","舞松原小学校"]
["１１０７","福浜小学校"]
["１１０８","南片江小学校"]
["１１０９","大原小学校"]
["１１１０","香椎東小学校"]
["１１１１","弥永西小学校"]
["１１１２","東若久小学校"]
["１１１３","四箇田小学校"]
["１１１４","壱岐東小学校"]
["１１１５","石丸小学校"]
["１１１６","鶴田小学校"]
["１１１７","田島小学校"]
["１１１８","愛宕小学校"]
["１１１９","福重小学校"]
["１１２０","三筑小学校"]
["１１２１","飯原小学校"]
["１１２２","青葉小学校"]
["１１２３","奈多小学校"]
["１１２４","野多目小学校"]
["１１２５","高木小学校"]
["１１２６","堤丘小学校"]
["１１２７","有住小学校"]
["１１２８","城原小学校"]
["１１２９","香椎浜小学校"]
["１１３０","大池小学校"]
["１１３１","早良小学校"]
["１１３２","香椎下原小学校"]
["１１３３","弥生小学校"]
["１１３４","塩原小学校"]
["１１３５","田村小学校"]
["１１３６","千早西小学校"]
["１１３７","東箱崎小学校"]
["１１３８","柏原小学校"]
["１１３９","飯倉中央小学校"]
["１１４０","玄洋小学校"]
["１１４１","小田部小学校"]
["１１４２","香陵小学校"]
["１１４３","百道浜小学校"]
["１１４４","松島小学校"]
["１１４５","横手小学校"]
["１１４６","三苫小学校"]
["１１４７","愛宕浜小学校"]
["１１４８","姪北小学校"]
["１１４９","照葉小学校"]
["１１５０","西都小学校"]
["１１５１","照葉北小学校"]
["１１５２","西都北小学校"]
["１１５３","照葉はばたき小学校"]
["２００１","箱崎中学校"]
["２００２","福岡中学校"]
["２００３","千代中学校"]
["２００４","東光中学校"]
["２００５","博多中学校"]
["２００７","東住吉中学校"]
["２００８","春吉中学校"]
["２００９","舞鶴中学校"]
["２０１０","高宮中学校"]
["２０１１","三宅中学校"]
["２０１２","警固中学校"]
["２０１３","当仁中学校"]
["２０１４","城西中学校"]
["２０１５","百道中学校"]
["２０１６","西福岡中学校"]
["２０１７","姪浜中学校"]
["２０１８","玄洋中学校"]
["２０１９","能古中学校"]
["２０２０","香椎第１中学校"]
["２０２１","多々良中学校"]
["２０２２","住吉中学校"]
["２０２３","花畑中学校"]
{"$rows_left_out":63}